BDBM50431227 CHEMBL2333024
SMILES CC(C)[C@H](NC(=O)c1cccnc1)C(=O)N1CCC[C@H]1B(O)O
InChI Key InChIKey=QWMROLCIGVLHNY-STQMWFEESA-N
Data  1 KI  6 IC50
  Tab Delimited (TSV)   2D SDfile   Computed 3D by Vconf -m prep SDfile
Find this compound or compounds like it in BindingDB:
Activity Spreadsheet -- Enzyme Inhibition Constant Data from BindingDB
Found 7 hits for monomerid = 50431227
TargetProlyl endopeptidase(Homo sapiens (Human))
Tufts University Sackler School Of Biomedical Sciences
Curated by ChEMBL
LigandPNGBDBM50431227(CHEMBL2333024)
Affinity DataKi:  0.730nM. Assay description: Competitive inhibition of human PREP using Suc-GP-AMC as substrate by Lineweaver-Burk plot analysis
In DepthDetails ArticlePubMed
TargetProlyl endopeptidase FAP(Homo sapiens (Human))
Tufts University Sackler School Of Biomedical Sciences
Curated by ChEMBL
LigandPNGBDBM50431227(CHEMBL2333024)
Affinity DataIC50: >1.00E+5nM. Assay description: Inhibition of human FAP using Z-Gly-Pro-AMC as substrate preincubated for 10 mins prior to substrate addition by fluorescence assay
In DepthDetails ArticlePubMed
TargetDipeptidyl peptidase 9(Homo sapiens (Human))
Tufts University Sackler School Of Biomedical Sciences
Curated by ChEMBL
LigandPNGBDBM50431227(CHEMBL2333024)
Affinity DataIC50: >1.00E+5nM. Assay description: Inhibition of human DPP9 using H-Gly-Pro-AMC as substrate preincubated for 10 mins prior to substrate addition by fluorescence assay
In DepthDetails ArticlePubMed
TargetProlyl endopeptidase FAP(Homo sapiens (Human))
Tufts University Sackler School Of Biomedical Sciences
Curated by ChEMBL
LigandPNGBDBM50431227(CHEMBL2333024)
Affinity DataIC50: >1.00E+5nM. Assay description: Inhibition of FAP (unknown origin)
In DepthDetails PubMed
TargetDipeptidyl peptidase 4(Homo sapiens (Human))
Tufts University Sackler School Of Biomedical Sciences
Curated by ChEMBL
LigandPNGBDBM50431227(CHEMBL2333024)
Affinity DataIC50: >1.00E+5nM. Assay description: Inhibition of human DPP4 using H-Gly-Pro-AMC as substrate preincubated for 10 mins prior to substrate addition by fluorescence assay
In DepthDetails ArticlePubMed
TargetProlyl endopeptidase(Homo sapiens (Human))
Tufts University Sackler School Of Biomedical Sciences
Curated by ChEMBL
LigandPNGBDBM50431227(CHEMBL2333024)
Affinity DataIC50:  1.30nM. Assay description: Inhibition of human PREP using Z-Gly-Pro-AMC as substrate preincubated for 10 mins prior to substrate addition by fluorescence assay
In DepthDetails ArticlePubMed
TargetDipeptidyl peptidase 8(Homo sapiens (Human))
Tufts University Sackler School Of Biomedical Sciences
Curated by ChEMBL
LigandPNGBDBM50431227(CHEMBL2333024)
Affinity DataIC50: >1.00E+5nM. Assay description: Inhibition of human DPP8 using H-Gly-Pro-AMC as substrate preincubated for 10 mins prior to substrate addition by fluorescence assay
In DepthDetails ArticlePubMed