BDBM50431363 CHEMBL46429
SMILES CNc1nc(C)c(s1)-c1ccnc(Nc2cccc(c2)[N+]([O-])=O)n1
InChI Key InChIKey=AXAQVNRYNMCZCK-UHFFFAOYSA-N
Data  4 KI
  Tab Delimited (TSV)   2D SDfile   Computed 3D by Vconf -m prep SDfile
Find this compound or compounds like it in BindingDB:
Activity Spreadsheet -- Enzyme Inhibition Constant Data from BindingDB
Found 4 hits for monomerid = 50431363
TargetCyclin-T1/Cyclin-dependent kinase 9(Homo sapiens (Human))
University Of Nottingham
Curated by ChEMBL
LigandPNGBDBM50431363(CHEMBL46429)
Affinity DataKi:  2nM. Assay description: Inhibition of human recombinant His6 tagged CDK9/CyclinT1 expressed in Sf21 insect cells after 40 mins by scintillation counting analysis
In DepthDetails ArticlePubMed
TargetCyclin-A1/Cyclin-A2/Cyclin-dependent kinase 2(Homo sapiens (Human))
University Of Nottingham
Curated by ChEMBL
LigandPNGBDBM50431363(CHEMBL46429)
Affinity DataKi:  3nM. Assay description: Inhibition of human recombinant His6 tagged CDK2/Cyclin A expressed in Sf21 insect cells after 40 mins by scintillation counting analysis
In DepthDetails ArticlePubMed
TargetCyclin-dependent kinase/G2/mitotic-specific cyclin- 1(Homo sapiens (Human))
University Of Nottingham
Curated by ChEMBL
LigandPNGBDBM50431363(CHEMBL46429)
Affinity DataKi:  5nM. Assay description: Inhibition of human recombinant His6 tagged CDK1/Cyclin B expressed in Sf21 insect cells after 40 mins by scintillation counting analysis
In DepthDetails ArticlePubMed
TargetCyclin-H/Cyclin-dependent kinase 7(Homo sapiens (Human))
University Of Nottingham
Curated by ChEMBL
LigandPNGBDBM50431363(CHEMBL46429)
Affinity DataKi:  417nM. Assay description: Inhibition of human recombinant His6 tagged CDK7/CyclinH/MAT1 expressed in Sf21 insect cells after 40 mins by scintillation counting analysis
In DepthDetails ArticlePubMed