BDBM50431427 CHEMBL2348279
SMILES CCCCn1c(C)c(C)cc(NC(=O)c2ccc(C)cc2)c1=O
InChI Key InChIKey=MEJRMKYZEJNQSP-UHFFFAOYSA-N
Data  2 KI
  Tab Delimited (TSV)   2D SDfile   Computed 3D by Vconf -m prep SDfile
Find this compound or compounds like it in BindingDB:
Activity Spreadsheet -- Enzyme Inhibition Constant Data from BindingDB
Found 2 hits for monomerid = 50431427
TargetCannabinoid receptor 2(Homo sapiens (Human))
Shionogi Pharmaceutical Research Center
Curated by ChEMBL
LigandPNGBDBM50431427(CHEMBL2348279)
Affinity DataKi:  72nM. Assay description: Displacement of [H3]-CP-55940 from human recombinant CB2 receptor expressed in CHO cells
In DepthDetails ArticlePubMed
TargetCannabinoid receptor 2(Homo sapiens (Human))
Shionogi Pharmaceutical Research Center
Curated by ChEMBL
LigandPNGBDBM50431427(CHEMBL2348279)
Affinity DataKi:  854nM. Assay description: Displacement of [H3]-CP-55940 from human recombinant CB1 receptor expressed in CHO cells
In DepthDetails ArticlePubMed