BDBM50431442 CHEMBL2348062
SMILES CCCCn1c(C)c(C)cc(Oc2nc3ccccc3o2)c1=O
InChI Key InChIKey=ZCGSTANOPYTMJD-UHFFFAOYSA-N
Data  1 KI
  Tab Delimited (TSV)   2D SDfile   Computed 3D by Vconf -m prep SDfile
Find this compound or compounds like it in BindingDB:
Activity Spreadsheet -- Enzyme Inhibition Constant Data from BindingDB
Found 1 hit for monomerid = 50431442
TargetCannabinoid receptor 2(Homo sapiens (Human))
Shionogi Pharmaceutical Research Center
Curated by ChEMBL
LigandPNGBDBM50431442(CHEMBL2348062)
Affinity DataKi:  976nM. Assay description: Displacement of [H3]-CP-55940 from human recombinant CB2 receptor expressed in CHO cells
In DepthDetails ArticlePubMed