BDBM50431470 TYROSOL SINAPATE
SMILES COc1cc(\C=C\C(=O)OCCc2ccc(O)cc2)cc(OC)c1O
InChI Key InChIKey=AQFYCJCVOFNYLP-VMPITWQZSA-N
Data  2 IC50
  Tab Delimited (TSV)   2D SDfile   Computed 3D by Vconf -m prep SDfile
Find this compound or compounds like it in BindingDB:
Activity Spreadsheet -- Enzyme Inhibition Constant Data from BindingDB
Found 2 hits for monomerid = 50431470
TargetHepatocyte growth factor receptor(Homo sapiens (Human))
University Of Louisiana At Monroe
Curated by ChEMBL
LigandPNGBDBM50431470(TYROSOL SINAPATE)
Affinity DataIC50:  1.37E+4nM. Assay description: Inhibition of c-MET phosphorylation (unknown origin) after 1 hr by Z'-LYTE kinase assay
In DepthDetails ArticlePubMed
TargetHepatocyte growth factor receptor(Homo sapiens (Human))
University Of Louisiana At Monroe
Curated by ChEMBL
LigandPNGBDBM50431470(TYROSOL SINAPATE)
Affinity DataIC50:  1.37E+4nM. Assay description: Inhibition of recombinant human N-terminal His-tagged cytoplasmic c-MET kinase domain (956 to 1390 residues) phosphorylation expressed in baculovirus...
In DepthDetails ArticlePubMed