BDBM50431912 CHEMBL2347827
SMILES CC(C)Nc1c(cnc2cc(ccc12)-c1cnc(C)s1)C#N
InChI Key InChIKey=LIDRYPOUXPJLGX-UHFFFAOYSA-N
Data  1 IC50
  Tab Delimited (TSV)   2D SDfile   Computed 3D by Vconf -m prep SDfile
Find this compound or compounds like it in BindingDB:
Activity Spreadsheet -- Enzyme Inhibition Constant Data from BindingDB
Found 1 hit for monomerid = 50431912
TargetLeucine-rich repeat serine/threonine-protein kinase 2(Homo sapiens (Human))
Elan Pharmaceuticals
Curated by ChEMBL
LigandPNGBDBM50431912(CHEMBL2347827)
Affinity DataIC50:  23nM. Assay description: Inhibition of wild type GST-tagged LRRK2 (970-2527 amino acids)(unknown origin) assessed as inhibition of LRRKtide phosphorylation by HTRF assay
In DepthDetails ArticlePubMed