BDBM50431954 CHEMBL2348492
SMILES NC(CCCCB(O)O)(Cc1cnc[nH]1)C(O)=O
InChI Key InChIKey=FJWGKBFAOAQNHV-UHFFFAOYSA-N
Data  2 IC50
  Tab Delimited (TSV)   2D SDfile   Computed 3D by Vconf -m prep SDfile
Find this compound or compounds like it in BindingDB:
Activity Spreadsheet -- Enzyme Inhibition Constant Data from BindingDB
Found 2 hits for monomerid = 50431954
TargetArginase-1(Homo sapiens (Human))
Institutes For Pharmaceutical Discovery
Curated by ChEMBL
LigandPNGBDBM50431954(CHEMBL2348492)
Affinity DataIC50:  2.28E+3nM. Assay description: Inhibition of human recombinant full length Arg1 using L-arginine as substrate assessed as urea level after 1 hr by colorimetric assay
In DepthDetails ArticlePubMed
TargetArginase-2, mitochondrial(Homo sapiens (Human))
Institutes For Pharmaceutical Discovery
Curated by ChEMBL
LigandPNGBDBM50431954(CHEMBL2348492)
Affinity DataIC50:  3.72E+3nM. Assay description: Inhibition of human Arg2 by colorimetric assay
In DepthDetails ArticlePubMed