BDBM50432097 CHEMBL2349560
SMILES COc1cc(Cl)c(Nc2nc(Br)cn([C@@H](COCCF)C3CC3)c2=O)c(Cl)c1
InChI Key InChIKey=ATTHUJRLLSVDIF-AWEZNQCLSA-N
Data  1 IC50
  Tab Delimited (TSV)   2D SDfile   Computed 3D by Vconf -m prep SDfile
Find this compound or compounds like it in BindingDB:
Activity Spreadsheet -- Enzyme Inhibition Constant Data from BindingDB
Found 1 hit for monomerid = 50432097
TargetCorticotropin-releasing factor receptor 1(Rattus norvegicus (rat))
Bristol-Myers Squibb Research And Development
Curated by ChEMBL
LigandPNGBDBM50432097(CHEMBL2349560)
Affinity DataIC50:  0.460nM. Assay description: Displacement of [125I]-o-CRF from CRF1 receptor in rat frontal cortex homogenate after 2 hrs by gamma counting
In DepthDetails ArticlePubMed