BDBM50432426 CHEMBL2349307
SMILES CC(C)C[C@H](CO)Nc1nc(SCc2ccccn2)nc2nc(N)sc12
InChI Key InChIKey=TXIZIPIJZWQRPG-GFCCVEGCSA-N
Data  2 KI
  Tab Delimited (TSV)   2D SDfile   Computed 3D by Vconf -m prep SDfile
Find this compound or compounds like it in BindingDB:
Activity Spreadsheet -- Enzyme Inhibition Constant Data from BindingDB
Found 2 hits for monomerid = 50432426
TargetC-X-C chemokine receptor type 2(Homo sapiens (Human))
Astrazeneca
Curated by ChEMBL
LigandPNGBDBM50432426(CHEMBL2349307)
Affinity DataKi:  64nM. Assay description: Displacement of [125I]-IL8 from human CXCR2 transfected in HEK293 cells after 4 hrs by microbeta counting analysis
In DepthDetails ArticlePubMed
TargetCX3C chemokine receptor 1(Homo sapiens (Human))
Astrazeneca
Curated by ChEMBL
LigandPNGBDBM50432426(CHEMBL2349307)
Affinity DataKi:  360nM. Assay description: Displacement of [125I]-CX3CL1 from human CX3CR1 transfected in HEK293 cells after 24 hrs by scintillation counting analysis
In DepthDetails ArticlePubMed