BDBM50432468 CHEMBL2349319
SMILES CC(C)C[C@H](CO)Nc1nc(S[C@@H](C)c2cccc(c2)S(C)(=O)=O)nc2nc(N)sc12
InChI Key InChIKey=ZJTOCCMPRIUOGK-GXTWGEPZSA-N
Data  2 KI
  Tab Delimited (TSV)   2D SDfile   Computed 3D by Vconf -m prep SDfile
Find this compound or compounds like it in BindingDB:
Activity Spreadsheet -- Enzyme Inhibition Constant Data from BindingDB
Found 2 hits for monomerid = 50432468
TargetCX3C chemokine receptor 1(Homo sapiens (Human))
Astrazeneca
Curated by ChEMBL
LigandPNGBDBM50432468(CHEMBL2349319)
Affinity DataKi:  28nM. Assay description: Displacement of [125I]-CX3CL1 from human CX3CR1 transfected in HEK293 cells after 24 hrs by scintillation counting analysis
In DepthDetails ArticlePubMed
TargetC-X-C chemokine receptor type 2(Homo sapiens (Human))
Astrazeneca
Curated by ChEMBL
LigandPNGBDBM50432468(CHEMBL2349319)
Affinity DataKi: >1.00E+5nM. Assay description: Displacement of [125I]-IL8 from human CXCR2 transfected in HEK293 cells after 4 hrs by microbeta counting analysis
In DepthDetails ArticlePubMed