BDBM50432595 CHEMBL2347185
SMILES CC(C)[C@H](NC(=O)N(C)Cc1csc(n1)C(C)C)C(=O)N[C@H](CC[C@H](Cc1ccccc1)NC(=O)OCc1cnc[nH]1)Cc1ccccc1
InChI Key InChIKey=JVLQVDCETUHZMB-QSCLJHCWSA-N
Data  1 IC50
  Tab Delimited (TSV)   2D SDfile   Computed 3D by Vconf -m prep SDfile
Find this compound or compounds like it in BindingDB:
Activity Spreadsheet -- Enzyme Inhibition Constant Data from BindingDB
Found 1 hit for monomerid = 50432595
TargetCytochrome P450 3A4(Homo sapiens (Human))
University Of California
Curated by ChEMBL
LigandPNGBDBM50432595(CHEMBL2347185)
Affinity DataIC50:  280nM. Assay description: Inhibition of C-terminal His-tagged wild type CYP3A4 (unknown origin)-mediated hydroxylation of 7-benzyloxy-4-trifluoromethylcoumarin expressed in Es...
In DepthDetails ArticlePubMed