BDBM50432689 CHEMBL2347964
SMILES CC(=O)Nc1ccc(cc1)-c1c(oc2ncnc(N[C@H](CO)c3ccccc3)c12)-c1ccccc1
InChI Key InChIKey=BMSYYYVQJGFDHW-HSZRJFAPSA-N
Data  1 IC50
  Tab Delimited (TSV)   2D SDfile   Computed 3D by Vconf -m prep SDfile
Find this compound or compounds like it in BindingDB:
Activity Spreadsheet -- Enzyme Inhibition Constant Data from BindingDB
Found 1 hit for monomerid = 50432689
TargetEpidermal growth factor receptor(Homo sapiens (Human))
National Health Research Institutes
Curated by ChEMBL
LigandPNGBDBM50432689(CHEMBL2347964)
Affinity DataIC50:  179nM. Assay description: Inhibition of human wild type GST-tagged EGFR kinase domain expressed in Sf9 cells by luminescence assay
In DepthDetails ArticlePubMed