BDBM50432752 FK-506
SMILES CO[C@@H]1C[C@@H](CC[C@H]1O)\C=C\[C@H](C)[C@@H]1OC(=O)[C@@H]2CCCCN2C(=O)C(=O)[C@]2(O)O[C@@H]([C@H](C[C@H]2C)OC)[C@H](C[C@@H](C)CC(C)=C[C@@H](CC=C)C(=O)C[C@H](O)[C@H]1C)OC
InChI Key InChIKey=ZNNSHTDPORCTHJ-JRBKMPAYSA-N
Data  1 KI
  Tab Delimited (TSV)   2D SDfile   Computed 3D by Vconf -m prep SDfile
Find this compound or compounds like it in BindingDB:
Activity Spreadsheet -- Enzyme Inhibition Constant Data from BindingDB
Found 1 hit for monomerid = 50432752
TargetPeptidyl-prolyl cis-trans isomerase FKBP5(Homo sapiens (Human))
Max Institute Of Psychiatry
Curated by ChEMBL
LigandPNGBDBM50432752(FK-506)
Affinity DataKi:  80nM. Assay description: Binding affinity to human FKBP51 by competitive fluorescence polarization assay
In DepthDetails ArticlePubMed