BDBM50432764 CHEMBL2348795
SMILES C[C@H](Nc1cccc2ccccc12)C(=O)Nc1ccc2oc(nc2c1)-c1ccncc1
InChI Key InChIKey=BVBCCFZWMVOJEU-INIZCTEOSA-N
Data  3 IC50
  Tab Delimited (TSV)   2D SDfile   Computed 3D by Vconf -m prep SDfile
Find this compound or compounds like it in BindingDB:
Activity Spreadsheet -- Enzyme Inhibition Constant Data from BindingDB
Found 3 hits for monomerid = 50432764
TargetInosine-5'-monophosphate dehydrogenase 2(Homo sapiens (Human))
Brandeis University
Curated by ChEMBL
LigandPNGBDBM50432764(CHEMBL2348795)
Affinity DataIC50: >5.00E+3nM. Assay description: Inhibition of human IMPDH2
In DepthDetails ArticlePubMed
TargetInosine-5'-monophosphate dehydrogenase(Cryptosporidium parvum)
Brandeis University
Curated by ChEMBL
LigandPNGBDBM50432764(CHEMBL2348795)
Affinity DataIC50:  14nM. Assay description: Inhibition of Cryptosporidium parvum N-terminal His6-tagged IMPDH-mediated NADH production expressed in Escherichia coli BL21(DE3) preincubated for 5...
In DepthDetails ArticlePubMed
TargetInosine-5'-monophosphate dehydrogenase(Cryptosporidium parvum)
Brandeis University
Curated by ChEMBL
LigandPNGBDBM50432764(CHEMBL2348795)
Affinity DataIC50:  15nM. Assay description: Inhibition of Cryptosporidium parvum N-terminal His6-tagged IMPDH-mediated NADH production expressed in Escherichia coli BL21(DE3) preincubated for 5...
In DepthDetails ArticlePubMed