BDBM50432877 CHEMBL2376644
SMILES C[C@@H](Oc1c[nH]c(=O)c(c1)-c1nc2ccc(cc2[nH]1)N1CCN(C)CC1)c1c(Cl)ccc(F)c1Cl
InChI Key InChIKey=OMVKEJJVHSVCLF-CQSZACIVSA-N
Data  1 IC50
  Tab Delimited (TSV)   2D SDfile   Computed 3D by Vconf -m prep SDfile
Find this compound or compounds like it in BindingDB:
Activity Spreadsheet -- Enzyme Inhibition Constant Data from BindingDB
Found 1 hit for monomerid = 50432877
TargetHepatocyte growth factor receptor(Homo sapiens (Human))
Chinese Academy Of Sciences
Curated by ChEMBL
LigandPNGBDBM50432877(CHEMBL2376644)
Affinity DataIC50:  130nM. Assay description: Inhibition of c-MET (unknown origin) after 60 mins by ELISA
In DepthDetails ArticlePubMed