BDBM50432941 CHEMBL2377204
SMILES COc1ccc(C)nc1NS(=O)(=O)c1ccc(cc1)-c1ccc(cc1)C#N
InChI Key InChIKey=CRHLETHKBQEMTI-UHFFFAOYSA-N
Data  1 EC50
  Tab Delimited (TSV)   2D SDfile   Computed 3D by Vconf -m prep SDfile
Find this compound or compounds like it in BindingDB:
Activity Spreadsheet -- Enzyme Inhibition Constant Data from BindingDB
Found 1 hit for monomerid = 50432941
Target11-beta-hydroxysteroid dehydrogenase 1(Homo sapiens (Human))
Pfizer
Curated by ChEMBL
LigandPNGBDBM50432941(CHEMBL2377204)
Affinity DataEC50: >1.00E+4nM. Assay description: Inhibition of 11beta-HSD1 in human HEK293 cells
In DepthDetails ArticlePubMed