BDBM50433066 CHEMBL2376116
SMILES ONC(=O)CNC(=O)CN1C(=O)C2(OCCO2)c2cc(Br)ccc12
InChI Key InChIKey=QZYGMPQOCGTULX-UHFFFAOYSA-N
Data  1 IC50
  Tab Delimited (TSV)   2D SDfile   Computed 3D by Vconf -m prep SDfile
Find this compound or compounds like it in BindingDB:
Activity Spreadsheet -- Enzyme Inhibition Constant Data from BindingDB
Found 1 hit for monomerid = 50433066
TargetAminopeptidase N(Sus scrofa (Pig))
Shandong University
Curated by ChEMBL
LigandPNGBDBM50433066(CHEMBL2376116)
Affinity DataIC50:  6.60E+3nM. Assay description: Inhibition of pig kidney microsome aminopeptidase-N using L-leu-p-nitroanilide as substrate incubated for 5 mins prior to substrate addition measured...
In DepthDetails ArticlePubMed