BDBM50433114 CHEMBL2377395
SMILES COc1ccc(cc1)C(=O)CCc1coc2cccc(OCC3CCCCC3)c2c1=O
InChI Key InChIKey=BGVHHOIKSKAZJQ-UHFFFAOYSA-N
Data  1 IC50
  Tab Delimited (TSV)   2D SDfile   Computed 3D by Vconf -m prep SDfile
Find this compound or compounds like it in BindingDB:
Activity Spreadsheet -- Enzyme Inhibition Constant Data from BindingDB
Found 1 hit for monomerid = 50433114
TargetInterleukin-5(Mus musculus)
Chungnam National University
Curated by ChEMBL
LigandPNGBDBM50433114(CHEMBL2377395)
Affinity DataIC50:  1.60E+4nM. Assay description: Inhibition interleukin-5 in mouse Y16 cells after 48 hrs by WST-1 assay
In DepthDetails ArticlePubMed