BDBM50433685 CHEMBL2381155
SMILES COc1cc(F)c(F)cc1-c1ccc(OCc2cccc3c2[nH]n(C[C@H](O)CO)c3=O)cc1
InChI Key InChIKey=NRDJLBSSVZLBQY-INIZCTEOSA-N
Data  1 EC50
  Tab Delimited (TSV)   2D SDfile   Computed 3D by Vconf -m prep SDfile
Find this compound or compounds like it in BindingDB:
Activity Spreadsheet -- Enzyme Inhibition Constant Data from BindingDB
Found 1 hit for monomerid = 50433685
TargetGlycogen [starch] synthase, muscle(Homo sapiens (Human))
Hoffmann-La Roche
Curated by ChEMBL
LigandPNGBDBM50433685(CHEMBL2381155)
Affinity DataEC50:  250nM. Assay description: Activation of human recombinant muscle GYS1 expressed in insect sf9 cells using glycogen and UDP-glucose as substrates by spectrophotometry
In DepthDetails ArticlePubMed