BDBM50433698 CHEMBL2381142
SMILES COCCn1[nH]c2c(COc3ccc(cc3)-c3cc(F)c(F)cc3F)cccc2c1=O
InChI Key InChIKey=OQFVRWFGGVKQKD-UHFFFAOYSA-N
Data  1 EC50
  Tab Delimited (TSV)   2D SDfile   Computed 3D by Vconf -m prep SDfile
Find this compound or compounds like it in BindingDB:
Activity Spreadsheet -- Enzyme Inhibition Constant Data from BindingDB
Found 1 hit for monomerid = 50433698
TargetGlycogen [starch] synthase, muscle(Homo sapiens (Human))
Hoffmann-La Roche
Curated by ChEMBL
LigandPNGBDBM50433698(CHEMBL2381142)
Affinity DataEC50:  790nM. Assay description: Activation of human recombinant muscle GYS1 expressed in insect sf9 cells using glycogen and UDP-glucose as substrates by spectrophotometry
In DepthDetails ArticlePubMed