BDBM50433700 CHEMBL2381140
SMILES Cc1cc(F)c(F)cc1-c1ccc(OCc2cccc3c2[nH]n(C)c3=O)cc1
InChI Key InChIKey=RQVGGDNYFKCMFU-UHFFFAOYSA-N
Data  1 EC50
  Tab Delimited (TSV)   2D SDfile   Computed 3D by Vconf -m prep SDfile
Find this compound or compounds like it in BindingDB:
Activity Spreadsheet -- Enzyme Inhibition Constant Data from BindingDB
Found 1 hit for monomerid = 50433700
TargetGlycogen [starch] synthase, muscle(Homo sapiens (Human))
Hoffmann-La Roche
Curated by ChEMBL
LigandPNGBDBM50433700(CHEMBL2381140)
Affinity DataEC50:  240nM. Assay description: Activation of human recombinant muscle GYS1 expressed in insect sf9 cells using glycogen and UDP-glucose as substrates by spectrophotometry
In DepthDetails ArticlePubMed