BDBM50433896 CHEMBL2380434
SMILES CCN(C)c1ccc(NC(=O)COc2ccc(cc2)C(C)(C)C)cn1
InChI Key InChIKey=YKFZUDPABMYUAT-UHFFFAOYSA-N
Data  1 IC50
  Tab Delimited (TSV)   2D SDfile   Computed 3D by Vconf -m prep SDfile
Find this compound or compounds like it in BindingDB:
Activity Spreadsheet -- Enzyme Inhibition Constant Data from BindingDB
Found 1 hit for monomerid = 50433896
TargetTransient receptor potential cation channel subfamily V member 1(Homo sapiens (Human))
Toray Industries
Curated by ChEMBL
LigandPNGBDBM50433896(CHEMBL2380434)
Affinity DataIC50:  583nM. Assay description: Antagonist activity at human TRPV1 transfected in CHOK1 cells assessed as inhibition of capsaicin-induced intracellular calcium level measured for 12...
In DepthDetails ArticlePubMed