BDBM50434002 CHEMBL2381016
SMILES C[C@H]1CCC[C@@H]1n1c(=O)cc(O)n(CCc2cccc(Cl)c2)c1=O
InChI Key InChIKey=QOWAYEHCGKUNTG-WFASDCNBSA-N
Data  1 IC50
  Tab Delimited (TSV)   2D SDfile   Computed 3D by Vconf -m prep SDfile
Find this compound or compounds like it in BindingDB:
Activity Spreadsheet -- Enzyme Inhibition Constant Data from BindingDB
Found 1 hit for monomerid = 50434002
TargetVoltage-dependent L-type calcium channel subunit alpha-1C(Oryctolagus cuniculus)
Northwestern University
Curated by ChEMBL
LigandPNGBDBM50434002(CHEMBL2381016)
Affinity DataIC50:  2.10E+4nM. Assay description: Antagonist activity at rabbit CaV1.2alpha1C transfected in HEK293 cells by FLIPR assay
In DepthDetails ArticlePubMed