BDBM50434028 CHEMBL2381211
SMILES Clc1ccc(CN(Cc2sccc2-n2cccc2)Cc2cccnc2)cc1
InChI Key InChIKey=MOUANSCJHIBIRY-UHFFFAOYSA-N
Data  1 IC50  1 EC50
  Tab Delimited (TSV)   2D SDfile   Computed 3D by Vconf -m prep SDfile
Find this compound or compounds like it in BindingDB:
Activity Spreadsheet -- Enzyme Inhibition Constant Data from BindingDB
Found 2 hits for monomerid = 50434028
TargetOxysterols receptor LXR-alpha(Homo sapiens (Human))
Glaxosmithkline
Curated by ChEMBL
LigandPNGBDBM50434028(CHEMBL2381211)
Affinity DataIC50:  4.00E+4nM. Assay description: Binding affinity to LXRalpha (unknown origin) by radioligand displacement assay
In DepthDetails ArticlePubMed
TargetNuclear receptor subfamily 1 group D member 1(Homo sapiens (Human))
Glaxosmithkline
Curated by ChEMBL
LigandPNGBDBM50434028(CHEMBL2381211)
Affinity DataEC50:  630nM. Assay description: Agonist activity at biotinylated REV-ERBalpha (unknown origin) assessed as increase in biotinylated NCOR peptide recruitment after 1 hr by FRET assay
In DepthDetails ArticlePubMed