BDBM50434070 CHEMBL2381340
SMILES CCOc1cc(ccc1Nc1ncc2N(C)C(=O)c3ccccc3N(C3CCCC3)c2n1)C(=O)N1CCC(CC1)N1CCN(C)CC1
InChI Key InChIKey=XVBGRTMNFNMINE-UHFFFAOYSA-N
Data  2 IC50  6 Kd  1 EC50
PDB links: 6 PDB IDs match this monomer.
  Tab Delimited (TSV)   2D SDfile   Computed 3D by Vconf -m prep SDfile
Find this compound or compounds like it in BindingDB:
Activity Spreadsheet -- Enzyme Inhibition Constant Data from BindingDB
Found 9 hits for monomerid = 50434070
TargetMitogen-activated protein kinase 7(Homo sapiens (Human))
University Of Oxford
Curated by ChEMBL
LigandPNGBDBM50434070(CHEMBL2381340)
Affinity DataEC50:  4.20E+3nM. Assay description: Inhibition of GST-tagged full length human ERK5 transfected in HEK293 cells assessed as inhibition of AP1 transcriptional activity after 24 hrs by du...
In DepthDetails ArticlePubMed
TargetSerine/threonine-protein kinase DCLK1(Homo sapiens (Human))
Harvard Medical School
Curated by ChEMBL
LigandPNGBDBM50434070(CHEMBL2381340)
Affinity DataIC50:  22nM. Assay description: Inhibition of recombinant human N-terminal His6-tagged DCLK1 (G351 to H689 residues) expressed in Escherichia coli BL21 DE3 using 5-FAM-KKLRRTLSVA-CO...
In DepthDetails ArticlePubMed
TargetLeucine-rich repeat serine/threonine-protein kinase 2(Homo sapiens (Human))
Harvard Medical School
Curated by ChEMBL
LigandPNGBDBM50434070(CHEMBL2381340)
Affinity DataIC50:  171nM. Assay description: Inhibition of recombinant human GST-tagged LRRK2 catalytic domain (970 to 2527 residues) expressed in baculovirus expression system using LRRKtide as...
In DepthDetails ArticlePubMed
TargetBromodomain-containing protein 4(Homo sapiens (Human))
Moffitt Cancer Center
Curated by ChEMBL
LigandPNGBDBM50434070(CHEMBL2381340)
Affinity DataKd:  205nM. Assay description: Binding affinity to recombinant human N-terminal hexaHis-tagged BRD4 expressed in Escherichia coli BL21 (DE3) cells by MST assay
TargetBromodomain testis-specific protein(Homo sapiens (Human))
Moffitt Cancer Center
Curated by ChEMBL
LigandPNGBDBM50434070(CHEMBL2381340)
Affinity DataKd:  2.10E+3nM. Assay description: Binding affinity to recombinant human N-terminal hexaHis-tagged BRDT expressed in Escherichia coli BL21 (DE3) cells by ITC analysis
TargetBromodomain-containing protein 4(Homo sapiens (Human))
Moffitt Cancer Center
Curated by ChEMBL
LigandPNGBDBM50434070(CHEMBL2381340)
Affinity DataKd:  213nM. Assay description: Binding affinity to recombinant human N-terminal hexaHis-tagged BRD4 expressed in Escherichia coli BL21 (DE3) cells by ITC analysis
TargetBromodomain testis-specific protein(Homo sapiens (Human))
Moffitt Cancer Center
Curated by ChEMBL
LigandPNGBDBM50434070(CHEMBL2381340)
Affinity DataKd:  1.60E+3nM. Assay description: Binding affinity to recombinant human N-terminal hexaHis-tagged BRDT expressed in Escherichia coli BL21 (DE3) cells by MST assay
TargetBromodomain testis-specific protein(Homo sapiens (Human))
Moffitt Cancer Center
Curated by ChEMBL
LigandPNGBDBM50434070(CHEMBL2381340)
Affinity DataKd:  500nM. Assay description: Binding affinity to recombinant human N-terminal hexaHis-tagged BRDT expressed in Escherichia coli BL21 (DE3) cells by qPCR assay
TargetBromodomain-containing protein 4(Homo sapiens (Human))
Moffitt Cancer Center
Curated by ChEMBL
LigandPNGBDBM50434070(CHEMBL2381340)
Affinity DataKd:  69nM. Assay description: Binding affinity to recombinant human N-terminal hexaHis-tagged BRD4 expressed in Escherichia coli BL21 (DE3) cells by qPCR assay