BDBM50434087 CHEMBL2381359
SMILES Nc1ccccc1C(=O)c1cn(nn1)-c1cccc(c1)-c1ccccc1
InChI Key InChIKey=IEUNVZDUSWXILQ-UHFFFAOYSA-N
Data  1 IC50
  Tab Delimited (TSV)   2D SDfile   Computed 3D by Vconf -m prep SDfile
Find this compound or compounds like it in BindingDB:
Activity Spreadsheet -- Enzyme Inhibition Constant Data from BindingDB
Found 1 hit for monomerid = 50434087
TargetSteroid hormone receptor ERR1(Homo sapiens (Human))
Chinese Academy Of Sciences
Curated by ChEMBL
LigandPNGBDBM50434087(CHEMBL2381359)
Affinity DataIC50:  650nM. Assay description: Inhibition of human GAL4-DBD-fused ERRalpha-LBD transcriptional activity transfected in human 293FT cells assessed as disruption of interaction with ...
In DepthDetails ArticlePubMed