BDBM50434366 CHEMBL1789430
SMILES C1CCN2\C(Sc3ccccc23)=C\C=C\c2sc3ccccc3[n+]2CCCCCN2\C(Sc3ccccc23)=C\C=C\c2sc3ccccc3[n+]2CC1
InChI Key InChIKey=YJMDHYKUCSPHIQ-UHFFFAOYSA-N
Data  1 IC50
  Tab Delimited (TSV)   2D SDfile   Computed 3D by Vconf -m prep SDfile
Find this compound or compounds like it in BindingDB:
Activity Spreadsheet -- Enzyme Inhibition Constant Data from BindingDB
Found 1 hit for monomerid = 50434366
TargetMicrotubule-associated protein tau(Homo sapiens (Human))
Humboldt Universit£T Zu Berlin
Curated by ChEMBL
LigandPNGBDBM50434366(CHEMBL1789430)
Affinity DataIC50:  80nM. Assay description: Inhibition of tau protein aggregation (unknown origin)
In DepthDetails ArticlePubMed