BDBM50434372 CHEMBL2386889
SMILES Cn1cc(cn1)-c1cnn2c(N)c(Br)c(nc12)[C@@H]1CCCNC1
InChI Key InChIKey=GMIZZEXBPRLVIV-SECBINFHSA-N
Data  1 IC50
  Tab Delimited (TSV)   2D SDfile   Computed 3D by Vconf -m prep SDfile
Find this compound or compounds like it in BindingDB:
Activity Spreadsheet -- Enzyme Inhibition Constant Data from BindingDB
Found 1 hit for monomerid = 50434372
TargetSerine/threonine-protein kinase Chk1(Homo sapiens (Human))
Texas State University-San Marcos
Curated by ChEMBL
LigandPNGBDBM50434372(CHEMBL2386889)
Affinity DataIC50:  3nM. Assay description: Competitive inhibition of recombinant His-tagged CHK1 (unknown origin) expressed in baculovirus expression system using CDC25C and ATP as substrate a...
In DepthDetails ArticlePubMed