BDBM50434373 CHEMBL2386992
SMILES O=C1C=CC(=O)N1c1ccncc1
InChI Key InChIKey=BTSOSPLPKKKCCJ-UHFFFAOYSA-N
Data  1 KI  1 IC50
  Tab Delimited (TSV)   2D SDfile   Computed 3D by Vconf -m prep SDfile
Find this compound or compounds like it in BindingDB:
Activity Spreadsheet -- Enzyme Inhibition Constant Data from BindingDB
Found 2 hits for monomerid = 50434373
TargetAcetylcholinesterase(Electrophorus electricus (Electric eel))
Banaras Hindu University
Curated by ChEMBL
LigandPNGBDBM50434373(CHEMBL2386992)
Affinity DataKi:  42nM. Assay description: Non-competitive inhibition of electric eel AChE using acetylcholine iodide as substrate by Lineweaver-Burk plot analysis
In DepthDetails ArticlePubMed
TargetAcetylcholinesterase(Electrophorus electricus (Electric eel))
Banaras Hindu University
Curated by ChEMBL
LigandPNGBDBM50434373(CHEMBL2386992)
Affinity DataIC50:  30nM. Assay description: Inhibition of electric eel AChE using acetylcholine iodide as substrate incubated for 20 mins prior to substrate addition by Ellman method
In DepthDetails ArticlePubMed