BDBM50434432 CHEMBL2387560
SMILES CC[C@H](C[C@H](O)[C@@H](N)CN1CC(=O)N(CC1(C)C)c1ccccc1Cl)C(=O)Nc1cc(OC)ccn1
InChI Key InChIKey=RBMYKBJTURYGSP-AGHHOFFYSA-N
Data  2 IC50
  Tab Delimited (TSV)   2D SDfile   Computed 3D by Vconf -m prep SDfile
Find this compound or compounds like it in BindingDB:
Activity Spreadsheet -- Enzyme Inhibition Constant Data from BindingDB
Found 2 hits for monomerid = 50434432
TargetRenin(Macaca fascicularis)
Daiichi Sankyo
Curated by ChEMBL
LigandPNGBDBM50434432(CHEMBL2387560)
Affinity DataIC50:  33nM. Assay description: Inhibition of renin in cynomolgus monkey plasma after 1 hr by RIA
In DepthDetails ArticlePubMed
TargetRenin(Homo sapiens (Human))
Daiichi Sankyo
Curated by ChEMBL
LigandPNGBDBM50434432(CHEMBL2387560)
Affinity DataIC50:  6.70nM. Assay description: Inhibition of human recombinant renin using Arg-Glu(EDANS)-Ile-His-Pro-Phe-His-Leu-Val-Ile-His-Thr-Lys (DABCYL)-Arg as substrate incubated for 10 min...
In DepthDetails ArticlePubMed