BDBM50434534 CHEMBL2386188
SMILES O(B(c1ccccc1)c1ccccc1)B(c1ccccc1)c1ccccc1
InChI Key InChIKey=SNQFEECGHGUHBK-UHFFFAOYSA-N
Data  2 IC50
  Tab Delimited (TSV)   2D SDfile   Computed 3D by Vconf -m prep SDfile
Find this compound or compounds like it in BindingDB:
Activity Spreadsheet -- Enzyme Inhibition Constant Data from BindingDB
Found 2 hits for monomerid = 50434534
TargetTransient receptor potential cation channel subfamily V member 6(Homo sapiens (Human))
University Of Bern
Curated by ChEMBL
LigandPNGBDBM50434534(CHEMBL2386188)
Affinity DataIC50:  1.92E+4nM. Assay description: Inhibition of human TRPV6 transfected in HEK293 cells assessed as inhibition of Ca2+ influx after 5 mins by FLIPR assay
In DepthDetails ArticlePubMed
TargetTransient receptor potential cation channel subfamily V member 6(Homo sapiens (Human))
University Of Bern
Curated by ChEMBL
LigandPNGBDBM50434534(CHEMBL2386188)
Affinity DataIC50:  1.77E+4nM. Assay description: Inhibition of human TRPV6 transfected in HEK293 cells assessed as inhibition of Cd2+ influx after 5 mins by FLIPR assay
In DepthDetails ArticlePubMed