BDBM50434718 CHEMBL2385194
SMILES COc1cc2c(Oc3ccc(NC(=O)c4nn(-c5ccc(Cl)c(c5)C(F)(F)F)c5ccccc5c4=O)cc3F)ccnc2cc1OCCCN1CCC(C)CC1
InChI Key InChIKey=FAGHBGHQYBASQO-UHFFFAOYSA-N
Data  1 IC50
  Tab Delimited (TSV)   2D SDfile   Computed 3D by Vconf -m prep SDfile
Find this compound or compounds like it in BindingDB:
Activity Spreadsheet -- Enzyme Inhibition Constant Data from BindingDB
Found 1 hit for monomerid = 50434718
TargetHepatocyte growth factor receptor(Homo sapiens (Human))
Shenyang Pharmaceutical University
Curated by ChEMBL
LigandPNGBDBM50434718(CHEMBL2385194)
Affinity DataIC50:  4.10nM. Assay description: Inhibition of c-Met (unknown origin) using poly (Glu, Tyr) 4:1 as substrate after 30 mins by HTRF assay
In DepthDetails ArticlePubMed