BDBM50435026 CHEMBL2391100
SMILES CC(=O)Nc1cc(ccn1)-c1nnc(SCc2ccccc2)o1
InChI Key InChIKey=PFSOTOJNKFKFFB-UHFFFAOYSA-N
Data  3 IC50
  Tab Delimited (TSV)   2D SDfile   Computed 3D by Vconf -m prep SDfile
Find this compound or compounds like it in BindingDB:
Activity Spreadsheet -- Enzyme Inhibition Constant Data from BindingDB
Found 3 hits for monomerid = 50435026
TargetCasein kinase I isoform epsilon(Homo sapiens (Human))
Technische Universit£T Darmstadt
Curated by ChEMBL
LigandPNGBDBM50435026(CHEMBL2391100)
Affinity DataIC50: >1.00E+5nM. Assay description: Inhibition of human recombinant CK1epsilon by FRET assay
In DepthDetails ArticlePubMed
TargetAurora kinase A(Homo sapiens (Human))
Technische Universit£T Darmstadt
Curated by ChEMBL
LigandPNGBDBM50435026(CHEMBL2391100)
Affinity DataIC50:  6.00E+4nM. Assay description: Inhibition of human recombinant AURKA by FRET assay
In DepthDetails ArticlePubMed
TargetCyclin-dependent kinase 5(Homo sapiens (Human))
Technische Universit£T Darmstadt
Curated by ChEMBL
LigandPNGBDBM50435026(CHEMBL2391100)
Affinity DataIC50: >1.00E+5nM. Assay description: Inhibition of human recombinant Cdk5/p35 by FRET assay
In DepthDetails ArticlePubMed