BDBM50435620 CHEMBL2391191
SMILES OC(=O)C1CCN(CC1)c1ccc(cc1)N1C[C@@H](CNCc2ccc(cc2)-c2nc(=O)o[nH]2)OC1=O
InChI Key InChIKey=FJUJZGZXOCKUHP-OAQYLSRUSA-N
Data  1 KI  1 IC50
  Tab Delimited (TSV)   2D SDfile   Computed 3D by Vconf -m prep SDfile
Find this compound or compounds like it in BindingDB:
Activity Spreadsheet -- Enzyme Inhibition Constant Data from BindingDB
Found 2 hits for monomerid = 50435620
TargetCoagulation factor X(Homo sapiens (Human))
University Of Ljubljana
Curated by ChEMBL
LigandPNGBDBM50435620(CHEMBL2391191)
Affinity DataKi:  9.48E+4nM. Assay description: Inhibition of F10a (unknown origin) using S-2222 as substrate incubated for 15 mins prior to substrate addition measured every 10 secs by spectrophot...
In DepthDetails ArticlePubMed
TargetIntegrin alpha-IIb/beta-3(Homo sapiens (Human))
University Of Ljubljana
Curated by ChEMBL
LigandPNGBDBM50435620(CHEMBL2391191)
Affinity DataIC50:  260nM. Assay description: Displacement of biotinylated fibrinogen from human glycoprotein 2b/3a receptor after 2 hrs by chemiluminescence assay
In DepthDetails ArticlePubMed