BDBM50435994 CHEMBL2392003
SMILES C[C@]12CC[C@H]3[C@@H](CC=C4C[C@H](CC[C@]34C)OC(=O)n3ccnc3)[C@@H]1CC=C2n1cnc2ccccc12
InChI Key InChIKey=MTIJOAMUOKRUQB-CNRUGTJDSA-N
Data  1 IC50
  Tab Delimited (TSV)   2D SDfile   Computed 3D by Vconf -m prep SDfile
Find this compound or compounds like it in BindingDB:
Activity Spreadsheet -- Enzyme Inhibition Constant Data from BindingDB
Found 1 hit for monomerid = 50435994
TargetSteroid 17-alpha-hydroxylase/17,20 lyase(Homo sapiens (Human))
University Of Maryland
Curated by ChEMBL
LigandPNGBDBM50435994(CHEMBL2392003)
Affinity DataIC50:  1.22E+5nM. Assay description: Inhibition of human truncated CYP17A1 expressed in Escherichia coli
In DepthDetails ArticlePubMed