BDBM50436049 CHEMBL2396744
SMILES OC(=O)[C@H](N1[C@@H](c2ccc(Cl)cc2)C(=O)Nc2ccc(I)cc2C1=O)c1ccc(Cl)cc1
InChI Key InChIKey=HQEQUYKKMMKSSX-VQTJNVASSA-N
Data  1 KI  1 IC50
  Tab Delimited (TSV)   2D SDfile   Computed 3D by Vconf -m prep SDfile
Find this compound or compounds like it in BindingDB:
Activity Spreadsheet -- Enzyme Inhibition Constant Data from BindingDB
Found 2 hits for monomerid = 50436049
TargetE3 ubiquitin-protein ligase Mdm2(Homo sapiens (Human))
University Of Pittsburgh
Curated by ChEMBL
LigandPNGBDBM50436049(CHEMBL2396744)
Affinity DataKi:  80nM. Assay description: Binding affinity to MDM2 (unknown origin) expressed in Escherichia coli BL21(DE3) after 30 mins by fluorescence polarization assay in presence of P4 ...
In DepthDetails ArticlePubMed
TargetE3 ubiquitin-protein ligase Mdm2(Homo sapiens (Human))
University Of Pittsburgh
Curated by ChEMBL
LigandPNGBDBM50436049(CHEMBL2396744)
Affinity DataIC50:  490nM. Assay description: Inhibition of p53 protein binding to MDM2 (unknown origin)
In DepthDetails ArticlePubMed