BDBM50436055 CHEMBL2397076
SMILES CC[C@H](C)[C@@H]1NC(=O)[C@](C)(CCC\C=C/CCC[C@](C)(NC(=O)[C@H](CC(O)=O)NC(=O)[C@H](CC(C)C)NC1=O)C(=O)N[C@@H](Cc1cnc[nH]1)C(=O)N[C@@H](C(C)C)C(=O)N[C@@H](CCCN=C(N)N)C(=O)N[C@@H](CCCN=C(N)N)C(=O)N[C@@H](C(C)C)C(=O)N[C@@H](Cc1c[nH]c2ccccc12)C(=O)N[C@@H](CCCN=C(N)N)C(N)=O)NC(=O)[C@H](CCC(N)=O)NC(=O)[C@@H]1CCCN1C(=O)[C@H](Cc1c[nH]c2ccccc12)NC(=O)[C@H](CCCN=C(N)N)NC(=O)[C@H](CCCN=C(N)N)NC(C)=O
InChI Key InChIKey=TULKZPPUJGHFFE-SKNFYVPGSA-N
Data  1 IC50  1 Kd
  Tab Delimited (TSV)   2D SDfile   Computed 3D by Vconf -m prep SDfile
Find this compound or compounds like it in BindingDB:
Activity Spreadsheet -- Enzyme Inhibition Constant Data from BindingDB
Found 2 hits for monomerid = 50436055
TargetCatenin beta-1(Homo sapiens (Human))
Chemical Genomics Centre Of The Max Planck Society
Curated by ChEMBL
LigandPNGBDBM50436055(CHEMBL2397076)
Affinity DataKd:  13nM. Assay description: Binding affinity to human beta-catenin expressed in Escherichia coli BL21 after 45 mins by fluorescence polarization assay
In DepthDetails ArticlePubMed
TargetCatenin beta-1(Homo sapiens (Human))
Chemical Genomics Centre Of The Max Planck Society
Curated by ChEMBL
LigandPNGBDBM50436055(CHEMBL2397076)
Affinity DataIC50:  5.00E+3nM. Assay description: Inhibition of beta-catenin-mediated transcriptional activity in Wnt3a-stimulated human HeLa cells after 24 hrs by Dual-Glo luciferase reporter gene a...
In DepthDetails ArticlePubMed