BDBM50436157 CHEMBL2398215
SMILES CCCCCCCCC(=O)CCCCCCCC
InChI Key InChIKey=WTJKUFMLQFLJOT-UHFFFAOYSA-N
Data  1 IC50
  Tab Delimited (TSV)   2D SDfile   Computed 3D by Vconf -m prep SDfile
Find this compound or compounds like it in BindingDB:
Activity Spreadsheet -- Enzyme Inhibition Constant Data from BindingDB
Found 1 hit for monomerid = 50436157
TargetBifunctional epoxide hydrolase 2(Homo sapiens (Human))
University Of California
Curated by ChEMBL
LigandPNGBDBM50436157(CHEMBL2398215)
Affinity DataIC50: >1.00E+5nM. Assay description: Inhibition of human recombinant soluble epoxide hydrolase using (cyano(6-methoxy-naphthelen-2-yl)methyl trans-[(3-phenyl-oxiran-2-yl)methyl] carbonat...
In DepthDetails ArticlePubMed