BDBM50436210 CHEMBL2398570
SMILES [#6]\[#6](-[#6])=[#6]\[#6]-[#6]\[#6](-[#6])=[#6]\[#6]-[#6]\[#6](-[#6])=[#6]\[#6]-[#8]-[#6](=O)C1([#6])[#6]-[#6]-c2c(-[#6])c(-[#8]-[#6]-[#6](-[#8])=O)c(-[#6])c(-[#6])c2-[#8]1
InChI Key InChIKey=AVEDYHXFWITSAP-CZHHEZJISA-N
Data  3 IC50  1 EC50
  Tab Delimited (TSV)   2D SDfile   Computed 3D by Vconf -m prep SDfile
Find this compound or compounds like it in BindingDB:
Activity Spreadsheet -- Enzyme Inhibition Constant Data from BindingDB
Found 4 hits for monomerid = 50436210
TargetPresenilin-1(Homo sapiens (Human))
Technische Universit£T Darmstadt
Curated by ChEMBL
LigandPNGBDBM50436210(CHEMBL2398570)
Affinity DataIC50:  3.98E+4nM. Assay description: Modulation of human gamma-secretase presenilin-1 subunit expressed in CHO cells coexpressing human APP assessed as decrease in amyloid beta 42 genera...
In DepthDetails ArticlePubMed
TargetPresenilin-1(Homo sapiens (Human))
Technische Universit£T Darmstadt
Curated by ChEMBL
LigandPNGBDBM50436210(CHEMBL2398570)
Affinity DataEC50:  1.00E+3nM. Assay description: Modulation of human gamma-secretase presenilin-1 subunit expressed in CHO cells coexpressing human APP assessed as increase in amyloid beta 38 genera...
In DepthDetails ArticlePubMed
TargetPresenilin-1(Homo sapiens (Human))
Technische Universit£T Darmstadt
Curated by ChEMBL
LigandPNGBDBM50436210(CHEMBL2398570)
Affinity DataIC50:  2.50E+4nM. Assay description: Modulation of human gamma-secretase presenilin-1 subunit expressed in CHO cells coexpressing human APP assessed as decrease in amyloid beta 40 genera...
In DepthDetails ArticlePubMed
TargetPresenilin-1(Homo sapiens (Human))
Technische Universit£T Darmstadt
Curated by ChEMBL
LigandPNGBDBM50436210(CHEMBL2398570)
Affinity DataIC50:  3.98E+4nM. Assay description: Modulation of human gamma-secretase presenilin-1 subunit expressed in CHO cells coexpressing human APP assessed as decrease in amyloid beta 42 genera...
In DepthDetails ArticlePubMed