BDBM50436214 CHEMBL2398577
SMILES CCCCCCCCCCCCCCOc1c(C)c(C)c2OC(C)(CCc2c1C)C(O)=O
InChI Key InChIKey=OJZKZGVSDVRSAW-UHFFFAOYSA-N
Data  3 IC50  1 EC50
  Tab Delimited (TSV)   2D SDfile   Computed 3D by Vconf -m prep SDfile
Find this compound or compounds like it in BindingDB:
Activity Spreadsheet -- Enzyme Inhibition Constant Data from BindingDB
Found 4 hits for monomerid = 50436214
TargetPresenilin-1(Homo sapiens (Human))
Technische Universit£T Darmstadt
Curated by ChEMBL
LigandPNGBDBM50436214(CHEMBL2398577)
Affinity DataIC50:  3.16E+4nM. Assay description: Modulation of human gamma-secretase presenilin-1 subunit expressed in CHO cells coexpressing human APP assessed as decrease in amyloid beta 42 genera...
In DepthDetails ArticlePubMed
TargetPresenilin-1(Homo sapiens (Human))
Technische Universit£T Darmstadt
Curated by ChEMBL
LigandPNGBDBM50436214(CHEMBL2398577)
Affinity DataEC50:  9.00E+3nM. Assay description: Modulation of human gamma-secretase presenilin-1 subunit expressed in CHO cells coexpressing human APP assessed as increase in amyloid beta 38 genera...
In DepthDetails ArticlePubMed
TargetPresenilin-1(Homo sapiens (Human))
Technische Universit£T Darmstadt
Curated by ChEMBL
LigandPNGBDBM50436214(CHEMBL2398577)
Affinity DataIC50:  2.90E+4nM. Assay description: Modulation of human gamma-secretase presenilin-1 subunit expressed in CHO cells coexpressing human APP assessed as decrease in amyloid beta 40 genera...
In DepthDetails ArticlePubMed
TargetPresenilin-1(Homo sapiens (Human))
Technische Universit£T Darmstadt
Curated by ChEMBL
LigandPNGBDBM50436214(CHEMBL2398577)
Affinity DataIC50:  3.16E+4nM. Assay description: Modulation of human gamma-secretase presenilin-1 subunit expressed in CHO cells coexpressing human APP assessed as decrease in amyloid beta 42 genera...
In DepthDetails ArticlePubMed