BDBM50436220 CHEMBL49563
SMILES CC(C)CCCC(C)CCCC(C)CCCC1(C)CCc2c(C)c(O)c(C)c(C)c2O1
InChI Key InChIKey=GVJHHUAWPYXKBD-UHFFFAOYSA-N
Data  2 IC50  1 EC50
PDB links: 3 PDB IDs match this monomer.
  Tab Delimited (TSV)   2D SDfile   Computed 3D by Vconf -m prep SDfile
Find this compound or compounds like it in BindingDB:
Activity Spreadsheet -- Enzyme Inhibition Constant Data from BindingDB
Found 3 hits for monomerid = 50436220
TargetPresenilin-1(Homo sapiens (Human))
Technische Universit£T Darmstadt
Curated by ChEMBL
LigandPNGBDBM50436220(CHEMBL49563)
Affinity DataIC50: >1.00E+5nM. Assay description: Modulation of human gamma-secretase presenilin-1 subunit expressed in CHO cells coexpressing human APP assessed as decrease in amyloid beta 42 genera...
In DepthDetails ArticlePubMed
TargetPresenilin-1(Homo sapiens (Human))
Technische Universit£T Darmstadt
Curated by ChEMBL
LigandPNGBDBM50436220(CHEMBL49563)
Affinity DataEC50: >1.00E+5nM. Assay description: Modulation of human gamma-secretase presenilin-1 subunit expressed in CHO cells coexpressing human APP assessed as increase in amyloid beta 38 genera...
In DepthDetails ArticlePubMed
TargetPresenilin-1(Homo sapiens (Human))
Technische Universit£T Darmstadt
Curated by ChEMBL
LigandPNGBDBM50436220(CHEMBL49563)
Affinity DataIC50: >1.00E+5nM. Assay description: Modulation of human gamma-secretase presenilin-1 subunit expressed in CHO cells coexpressing human APP assessed as decrease in amyloid beta 40 genera...
In DepthDetails ArticlePubMed