BDBM50436260 CHEMBL2398717
SMILES CC(C)[C@@H](NC(=O)CC1CC1)C(=O)N1CC[C@](O)(c2ccc(Cl)cc2)C(C)(C)C1
InChI Key InChIKey=CZEQXLMAKRKHJC-OFNKIYASSA-N
Data  1 IC50
PDB links: 2 PDB IDs match this monomer.
  Tab Delimited (TSV)   2D SDfile   Computed 3D by Vconf -m prep SDfile
Find this compound or compounds like it in BindingDB:
Activity Spreadsheet -- Enzyme Inhibition Constant Data from BindingDB
Found 1 hit for monomerid = 50436260
TargetC-C chemokine receptor type 1(Homo sapiens (Human))
Bristol-Myers Squibb
Curated by ChEMBL
LigandPNGBDBM50436260(CHEMBL2398717)
Affinity DataIC50:  1nM. Assay description: Binding affinity to human CCR1
In DepthDetails ArticlePubMed