BDBM50436299 CHEMBL2398723
SMILES CC(C)[C@@H](NC(=O)[C@@H]1CCC[C@H]1O)C(=O)N1CC[C@](O)(c2ccc(Cl)cc2)C(C)(C)C1
InChI Key InChIKey=BPFQMWZMSDPOCI-FIXDAVPBSA-N
Data  1 IC50
  Tab Delimited (TSV)   2D SDfile   Computed 3D by Vconf -m prep SDfile
Find this compound or compounds like it in BindingDB:
Activity Spreadsheet -- Enzyme Inhibition Constant Data from BindingDB
Found 1 hit for monomerid = 50436299
TargetC-C chemokine receptor type 1(Homo sapiens (Human))
Bristol-Myers Squibb
Curated by ChEMBL
LigandPNGBDBM50436299(CHEMBL2398723)
Affinity DataIC50:  20nM. Assay description: Binding affinity to human CCR1
In DepthDetails ArticlePubMed