BDBM50436309 CHEMBL2398756
SMILES CC(C)[C@@H](NC(=O)c1ccc(Cl)cc1)C(=O)N1CC[C@](N(C)C)(c2ccc(Cl)cc2)C(C)(C)C1
InChI Key InChIKey=ZHKTTWXMVJEZDY-KCWPFWIISA-N
Data  1 IC50
  Tab Delimited (TSV)   2D SDfile   Computed 3D by Vconf -m prep SDfile
Find this compound or compounds like it in BindingDB:
Activity Spreadsheet -- Enzyme Inhibition Constant Data from BindingDB
Found 1 hit for monomerid = 50436309
TargetC-C chemokine receptor type 1(Homo sapiens (Human))
Bristol-Myers Squibb
Curated by ChEMBL
LigandPNGBDBM50436309(CHEMBL2398756)
Affinity DataIC50: >8.33E+3nM. Assay description: Binding affinity to human CCR1
In DepthDetails ArticlePubMed