BDBM50436327 CHEMBL2398805
SMILES Cc1ccccc1[C@@H]1OC[C@]2(C)[C@H](CC[C@@]3(C)[C@H]2C[C@H](OC(=O)c2ccc(F)cc2)[C@@]2(C)Oc4cc(oc(=O)c4[C@H](O)[C@H]32)-c2cccnc2)O1
InChI Key InChIKey=HUEQAFBTLSJEBL-WVGFPPCDSA-N
Data  2 IC50
  Tab Delimited (TSV)   2D SDfile   Computed 3D by Vconf -m prep SDfile
Find this compound or compounds like it in BindingDB:
Activity Spreadsheet -- Enzyme Inhibition Constant Data from BindingDB
Found 2 hits for monomerid = 50436327
TargetSterol O-acyltransferase 1(Homo sapiens (Human))
Kitasato University
Curated by ChEMBL
LigandPNGBDBM50436327(CHEMBL2398805)
Affinity DataIC50:  1.39E+4nM. Assay description: Inhibition of ACAT1 (unknown origin)
In DepthDetails ArticlePubMed
TargetSterol O-acyltransferase 2(Homo sapiens (Human))
Kitasato University
Curated by ChEMBL
LigandPNGBDBM50436327(CHEMBL2398805)
Affinity DataIC50:  23nM. Assay description: Inhibition of ACAT2 (unknown origin)
In DepthDetails ArticlePubMed