BDBM50436333 CHEMBL2398799
SMILES C[C@]12CC[C@@H]3O[C@@H](OC[C@@]3(C)[C@@H]1C[C@H](OC(=O)c1ccc(cc1)[N+]([O-])=O)[C@@]1(C)Oc3cc(oc(=O)c3[C@H](O)[C@H]21)-c1cccnc1)c1ccccc1
InChI Key InChIKey=XFYILCZWJPXUMJ-MKSFZIRSSA-N
Data  2 IC50
  Tab Delimited (TSV)   2D SDfile   Computed 3D by Vconf -m prep SDfile
Find this compound or compounds like it in BindingDB:
Activity Spreadsheet -- Enzyme Inhibition Constant Data from BindingDB
Found 2 hits for monomerid = 50436333
TargetSterol O-acyltransferase 1(Homo sapiens (Human))
Kitasato University
Curated by ChEMBL
LigandPNGBDBM50436333(CHEMBL2398799)
Affinity DataIC50:  1.39E+4nM. Assay description: Inhibition of ACAT1 (unknown origin)
In DepthDetails ArticlePubMed
TargetSterol O-acyltransferase 2(Homo sapiens (Human))
Kitasato University
Curated by ChEMBL
LigandPNGBDBM50436333(CHEMBL2398799)
Affinity DataIC50:  60nM. Assay description: Inhibition of ACAT2 (unknown origin)
In DepthDetails ArticlePubMed