BDBM50436336 CHEMBL2396681
SMILES C[C@@]12CO[C@H](O[C@H]1CC[C@@]1(C)[C@H]2C[C@H](OC(=O)c2cccc(Br)c2)[C@@]2(C)Oc3cc(oc(=O)c3[C@H](O)[C@H]12)-c1cccnc1)c1ccccc1
InChI Key InChIKey=WFUZEGYAYGGPQL-MKSFZIRSSA-N
Data  2 IC50
  Tab Delimited (TSV)   2D SDfile   Computed 3D by Vconf -m prep SDfile
Find this compound or compounds like it in BindingDB:
Activity Spreadsheet -- Enzyme Inhibition Constant Data from BindingDB
Found 2 hits for monomerid = 50436336
TargetSterol O-acyltransferase 1(Homo sapiens (Human))
Kitasato University
Curated by ChEMBL
LigandPNGBDBM50436336(CHEMBL2396681)
Affinity DataIC50:  4.30E+3nM. Assay description: Inhibition of ACAT1 (unknown origin)
In DepthDetails ArticlePubMed
TargetSterol O-acyltransferase 2(Homo sapiens (Human))
Kitasato University
Curated by ChEMBL
LigandPNGBDBM50436336(CHEMBL2396681)
Affinity DataIC50:  30nM. Assay description: Inhibition of ACAT2 (unknown origin)
In DepthDetails ArticlePubMed