BDBM50436360 CHEMBL2396723
SMILES COc1ccc(CNC(=O)COc2ccc(cc2)-c2oc3cc(O)c(cc3c2C#Cc2cccc(Cl)c2)C(O)=O)cc1OC
InChI Key InChIKey=ZPADSLQTACUIOL-UHFFFAOYSA-N
Data  1 IC50
  Tab Delimited (TSV)   2D SDfile   Computed 3D by Vconf -m prep SDfile
Find this compound or compounds like it in BindingDB:
Activity Spreadsheet -- Enzyme Inhibition Constant Data from BindingDB
Found 1 hit for monomerid = 50436360
TargetTyrosine-protein phosphatase non-receptor type 22(Homo sapiens (Human))
Indiana University School Of Medicine
Curated by ChEMBL
LigandPNGBDBM50436360(CHEMBL2396723)
Affinity DataIC50:  259nM. Assay description: Inhibition of N-terminal 6xHis-tagged LYP catalytic domain (1 to 303) (unknown origin) expressed in Escherichia coli BL21(DE3) using pNPP as substrat...
In DepthDetails ArticlePubMed