BDBM50436543 CHEMBL2397480
SMILES CCCN(CCCCNC(=O)c1cc2ccccc2s1)[C@H]1CCC(=CC1)C#C
InChI Key InChIKey=OVRYUDOMQFGLII-OAQYLSRUSA-N
Data  5 KI
  Tab Delimited (TSV)   2D SDfile   Computed 3D by Vconf -m prep SDfile
Find this compound or compounds like it in BindingDB:
Activity Spreadsheet -- Enzyme Inhibition Constant Data from BindingDB
Found 5 hits for monomerid = 50436543
TargetD(3) dopamine receptor(Homo sapiens (Human))
Friedrich-Alexander University
Curated by ChEMBL
LigandPNGBDBM50436543(CHEMBL2397480)
Affinity DataKi:  0.430nM. Assay description: Displacement of [3H]spiperone from human dopamine D3 receptor expressed in CHO cells
In DepthDetails ArticlePubMed
TargetD(2) dopamine receptor(Homo sapiens (Human))
Friedrich-Alexander University
Curated by ChEMBL
LigandPNGBDBM50436543(CHEMBL2397480)
Affinity DataKi:  2nM. Assay description: Displacement of [3H]7-OH-DPAT from human dopamine D2L receptor expressed in CHO cells
In DepthDetails ArticlePubMed
TargetD(2) dopamine receptor(Homo sapiens (Human))
Friedrich-Alexander University
Curated by ChEMBL
LigandPNGBDBM50436543(CHEMBL2397480)
Affinity DataKi:  2nM. Assay description: Displacement of [3H]7-OH-DPAT from human dopamine D2L receptor expressed in CHO cells
In DepthDetails ArticlePubMed
TargetD(2) dopamine receptor(Homo sapiens (Human))
Friedrich-Alexander University
Curated by ChEMBL
LigandPNGBDBM50436543(CHEMBL2397480)
Affinity DataKi:  16nM. Assay description: Displacement of [3H]spiperone from human dopamine D2S receptor expressed in CHO cells
In DepthDetails ArticlePubMed
TargetD(1A) dopamine receptor(Sus scrofa)
Friedrich-Alexander University
Curated by ChEMBL
LigandPNGBDBM50436543(CHEMBL2397480)
Affinity DataKi:  4.70E+3nM. Assay description: Displacement of [3H]SCH23390 from dopamine D1 receptor in porcine striatal membranes
In DepthDetails ArticlePubMed