BDBM50436545 CHEMBL2397478
SMILES CCCCn1ncc(CCCOc2ccc(cc2OC)C(=O)NCCCCN(CCC)[C@H]2CCC(=CC2)C#C)n1
InChI Key InChIKey=HKOJNCZKZSYFEQ-GDLZYMKVSA-N
Data  5 KI
  Tab Delimited (TSV)   2D SDfile   Computed 3D by Vconf -m prep SDfile
Find this compound or compounds like it in BindingDB:
Activity Spreadsheet -- Enzyme Inhibition Constant Data from BindingDB
Found 5 hits for monomerid = 50436545
TargetD(2) dopamine receptor(Homo sapiens (Human))
Friedrich-Alexander University
Curated by ChEMBL
LigandPNGBDBM50436545(CHEMBL2397478)
Affinity DataKi:  0.530nM. Assay description: Displacement of [3H]7-OH-DPAT from human dopamine D2L receptor expressed in CHO cells
In DepthDetails ArticlePubMed
TargetD(3) dopamine receptor(Homo sapiens (Human))
Friedrich-Alexander University
Curated by ChEMBL
LigandPNGBDBM50436545(CHEMBL2397478)
Affinity DataKi:  1nM. Assay description: Displacement of [3H]spiperone from human dopamine D3 receptor expressed in CHO cells
In DepthDetails ArticlePubMed
TargetD(2) dopamine receptor(Homo sapiens (Human))
Friedrich-Alexander University
Curated by ChEMBL
LigandPNGBDBM50436545(CHEMBL2397478)
Affinity DataKi:  3.90nM. Assay description: Displacement of [3H]spiperone from human dopamine D2S receptor expressed in CHO cells
In DepthDetails ArticlePubMed
TargetD(2) dopamine receptor(Homo sapiens (Human))
Friedrich-Alexander University
Curated by ChEMBL
LigandPNGBDBM50436545(CHEMBL2397478)
Affinity DataKi:  6nM. Assay description: Displacement of [3H]spiperone from human dopamine D2L receptor expressed in CHO cells
In DepthDetails ArticlePubMed
TargetD(1A) dopamine receptor(Sus scrofa)
Friedrich-Alexander University
Curated by ChEMBL
LigandPNGBDBM50436545(CHEMBL2397478)
Affinity DataKi:  1.30E+4nM. Assay description: Displacement of [3H]SCH23390 from dopamine D1 receptor in porcine striatal membranes
In DepthDetails ArticlePubMed